Reaction Details
TargetCarbonic anhydrase 4
LigandBDBM50185301
Substrate/Competitorn/a
Meas. Tech.ChEMBL_1587514 (CHEMBL3825323)
Ki 7.8±n/a nM
Citation Akocak, SAlam, MRShabana, AMSanku, RKVullo, DThompson, HSwenson, ERSupuran, CTIlies, MA PEGylated Bis-Sulfonamide Carbonic Anhydrase Inhibitors Can Efficiently Control the Growth of Several Carbonic Anhydrase IX-Expressing Carcinomas. J Med Chem59:5077-88 (2016) 
 
Carbonic anhydrase 4
Name:Carbonic anhydrase 4
Type:Enzyme
Mol. Mass.:35037.98
Organism:Homo sapiens (Human)
Description:P22748
Residue:312
BDBM50185301
NameBDBM50185301
Synonyms:CHEMBL3824097
TypeSmall organic molecule
Emp. Form.C26H36N6O10S2
Mol. Mass.656.728
SMILESNS(=O)(=O)c1ccc(NC(=O)CCC(=O)NCCOCCOCCNC(=O)CCC(=O)Nc2ccc(cc2)S(N)(=O)=O)cc1