Reaction Details
TargetCarbonic anhydrase 2
LigandBDBM50185298
Substrate/Competitorn/a
Meas. Tech.ChEMBL_1587513 (CHEMBL3825322)
Ki 1764±n/a nM
Citation Akocak, SAlam, MRShabana, AMSanku, RKVullo, DThompson, HSwenson, ERSupuran, CTIlies, MA PEGylated Bis-Sulfonamide Carbonic Anhydrase Inhibitors Can Efficiently Control the Growth of Several Carbonic Anhydrase IX-Expressing Carcinomas. J Med Chem59:5077-88 (2016) 
 
Carbonic anhydrase 2
Name:Carbonic anhydrase 2
Type:Enzyme
Mol. Mass.:29250.71
Organism:Homo sapiens (Human)
Description:P00918
Residue:260
BDBM50185298
NameBDBM50185298
Synonyms:CHEMBL3823514
TypeSmall organic molecule
Emp. Form.C112H208N6O53S2
Mol. Mass.2550.988
SMILESNS(=O)(=O)c1ccc(NC(=O)CCC(=O)NCCOCCOCCOCCOCCOCCOCCOCCOCCOCCOCCOCCOCCOCCOCCOCCOCCOCCOCCOCCOCCOCCOCCOCCOCCOCCOCCOCCOCCOCCOCCOCCOCCOCCOCCOCCOCCOCCOCCOCCOCCOCCOCCOCCOCCOCCNC(=O)CCC(=O)Nc2ccc(cc2)S(N)(=O)=O)cc1