Reaction Details
TargetCarbonic anhydrase 2
LigandBDBM50185303
Substrate/Competitorn/a
Meas. Tech.ChEMBL_1587513 (CHEMBL3825322)
Ki 8.1±n/a nM
Citation Akocak, SAlam, MRShabana, AMSanku, RKVullo, DThompson, HSwenson, ERSupuran, CTIlies, MA PEGylated Bis-Sulfonamide Carbonic Anhydrase Inhibitors Can Efficiently Control the Growth of Several Carbonic Anhydrase IX-Expressing Carcinomas. J Med Chem59:5077-88 (2016) 
 
Carbonic anhydrase 2
Name:Carbonic anhydrase 2
Type:Enzyme
Mol. Mass.:29250.71
Organism:Homo sapiens (Human)
Description:P00918
Residue:260
BDBM50185303
NameBDBM50185303
Synonyms:CHEMBL88115
TypeSmall organic molecule
Emp. Form.C6H8N4O5S2
Mol. Mass.280.282
SMILESNS(=O)(=O)c1nnc(NC(=O)CCC(O)=O)s1