Reaction Details
TargetCarbonic anhydrase 12
LigandBDBM50185302
Substrate/Competitorn/a
Meas. Tech.ChEMBL_1587516 (CHEMBL3825325)
Ki 3.9±n/a nM
Citation Akocak, SAlam, MRShabana, AMSanku, RKVullo, DThompson, HSwenson, ERSupuran, CTIlies, MA PEGylated Bis-Sulfonamide Carbonic Anhydrase Inhibitors Can Efficiently Control the Growth of Several Carbonic Anhydrase IX-Expressing Carcinomas. J Med Chem59:5077-88 (2016) 
 
Carbonic anhydrase 12
Name:Carbonic anhydrase 12
Type:Enzyme
Mol. Mass.:39456.00
Organism:Homo sapiens (Human)
Description:Catalytic domain of human cloned isozyme was used in the assay
Residue:354
BDBM50185302
NameBDBM50185302
Synonyms:CHEMBL3823618
TypeSmall organic molecule
Emp. Form.C12H13N5O7S3
Mol. Mass.435.456
SMILESNS(=O)(=O)c1nnc(NS(=O)(=O)c2ccc(NC(=O)CCC(O)=O)cc2)s1