Reaction Details
TargetCarbonic anhydrase 14
LigandBDBM50185301
Substrate/Competitorn/a
Meas. Tech.ChEMBL_1587517 (CHEMBL3825326)
Ki 6.2±n/a nM
Citation Akocak, SAlam, MRShabana, AMSanku, RKVullo, DThompson, HSwenson, ERSupuran, CTIlies, MA PEGylated Bis-Sulfonamide Carbonic Anhydrase Inhibitors Can Efficiently Control the Growth of Several Carbonic Anhydrase IX-Expressing Carcinomas. J Med Chem59:5077-88 (2016) 
 
Carbonic anhydrase 14
Name:Carbonic anhydrase 14
Type:Enzyme
Mol. Mass.:37665.67
Organism:Homo sapiens (Human)
Description:Human (cloned) isozyme.
Residue:337
BDBM50185301
NameBDBM50185301
Synonyms:CHEMBL3824097
TypeSmall organic molecule
Emp. Form.C26H36N6O10S2
Mol. Mass.656.728
SMILESNS(=O)(=O)c1ccc(NC(=O)CCC(=O)NCCOCCOCCNC(=O)CCC(=O)Nc2ccc(cc2)S(N)(=O)=O)cc1