Reaction Details
TargetCarbonic anhydrase 14
LigandBDBM50185300
Substrate/Competitorn/a
Meas. Tech.ChEMBL_1587517 (CHEMBL3825326)
Ki 4.6±n/a nM
Citation Akocak, SAlam, MRShabana, AMSanku, RKVullo, DThompson, HSwenson, ERSupuran, CTIlies, MA PEGylated Bis-Sulfonamide Carbonic Anhydrase Inhibitors Can Efficiently Control the Growth of Several Carbonic Anhydrase IX-Expressing Carcinomas. J Med Chem59:5077-88 (2016) 
 
Carbonic anhydrase 14
Name:Carbonic anhydrase 14
Type:Enzyme
Mol. Mass.:37665.67
Organism:Homo sapiens (Human)
Description:Human (cloned) isozyme.
Residue:337
BDBM50185300
NameBDBM50185300
Synonyms:CHEMBL3822486
TypeSmall organic molecule
Emp. Form.C18H28N10O10S4
Mol. Mass.672.736
SMILESNS(=O)(=O)c1nnc(NC(=O)CCC(=O)NCCOCCOCCNC(=O)CCC(=O)Nc2nnc(s2)S(N)(=O)=O)s1