Reaction Details
TargetMu-type opioid receptor
LigandBDBM50185309
Substrate/Competitorn/a
Meas. Tech.ChEMBL_1587704 (CHEMBL3825884)
Ki 0.100000±n/a nM
Citation Harland, AABender, AMGriggs, NWGao, CAnand, JPPogozheva, IDTraynor, JRJutkiewicz, EMMosberg, HI Effects of N-Substitutions on the Tetrahydroquinoline (THQ) Core of Mixed-Efficacyµ-Opioid Receptor (MOR)/d-Opioid Receptor (DOR) Ligands. J Med Chem59:4985-98 (2016) 
 
Mu-type opioid receptor
Name:Mu-type opioid receptor
Type:G Protein-Coupled Receptor (GPCR)
Mol. Mass.:44503.11
Organism:Rattus norvegicus (rat)
Description:Competition binding assays were carried out using membrane preparations from transfected HN9.10 cells that constitutively expressed the mu opioid receptor.
Residue:398
BDBM50185309
NameBDBM50185309
Synonyms:CHEMBL3824052
TypeSmall organic molecule
Emp. Form.C31H37N3O3
Mol. Mass.499.6438
SMILESCCCC(=O)N1CC[C@@H](NC(=O)[C@@H](N)Cc2c(C)cc(O)cc2C)c2cc(Cc3ccccc3)ccc12