Reaction Details
TargetDelta-type opioid receptor
LigandBDBM50185315
Substrate/Competitorn/a
Meas. Tech.ChEMBL_1587705 (CHEMBL3825885)
Ki 0.240000±n/a nM
Citation Harland, AABender, AMGriggs, NWGao, CAnand, JPPogozheva, IDTraynor, JRJutkiewicz, EMMosberg, HI Effects of N-Substitutions on the Tetrahydroquinoline (THQ) Core of Mixed-Efficacyµ-Opioid Receptor (MOR)/d-Opioid Receptor (DOR) Ligands. J Med Chem59:4985-98 (2016) 
 
Delta-type opioid receptor
Name:Delta-type opioid receptor
Type:G Protein-Coupled Receptor (GPCR)
Mol. Mass.:40465.04
Organism:Rattus norvegicus (rat)
Description:Competition binding assays were using CHO-K1 cell membranes expressing the opioid receptor.
Residue:372
BDBM50185315
NameBDBM50185315
Synonyms:CHEMBL3823958
TypeSmall organic molecule
Emp. Form.C34H35N3O3
Mol. Mass.533.66
SMILESCc1cc(O)cc(C)c1C[C@H](N)C(=O)N[C@@H]1CCN(C(=O)c2ccccc2)c2ccc(Cc3ccccc3)cc12