Reaction Details
TargetKappa-type opioid receptor
LigandBDBM50185315
Substrate/Competitorn/a
Meas. Tech.ChEMBL_1587706 (CHEMBL3825886)
Ki 39±n/a nM
Citation Harland, AABender, AMGriggs, NWGao, CAnand, JPPogozheva, IDTraynor, JRJutkiewicz, EMMosberg, HI Effects of N-Substitutions on the Tetrahydroquinoline (THQ) Core of Mixed-Efficacyµ-Opioid Receptor (MOR)/d-Opioid Receptor (DOR) Ligands. J Med Chem59:4985-98 (2016) 
 
Kappa-type opioid receptor
Name:Kappa-type opioid receptor
Type:G Protein-Coupled Receptor (GPCR)
Mol. Mass.:42648.76
Organism:Homo sapiens (Human)
Description:P41145
Residue:380
BDBM50185315
NameBDBM50185315
Synonyms:CHEMBL3823958
TypeSmall organic molecule
Emp. Form.C34H35N3O3
Mol. Mass.533.66
SMILESCc1cc(O)cc(C)c1C[C@H](N)C(=O)N[C@@H]1CCN(C(=O)c2ccccc2)c2ccc(Cc3ccccc3)cc12