Reaction Details
TargetKappa-type opioid receptor
LigandBDBM50185330
Substrate/Competitorn/a
Meas. Tech.ChEMBL_1587706 (CHEMBL3825886)
Ki 190±n/a nM
Citation Harland, AABender, AMGriggs, NWGao, CAnand, JPPogozheva, IDTraynor, JRJutkiewicz, EMMosberg, HI Effects of N-Substitutions on the Tetrahydroquinoline (THQ) Core of Mixed-Efficacyµ-Opioid Receptor (MOR)/d-Opioid Receptor (DOR) Ligands. J Med Chem59:4985-98 (2016) 
 
Kappa-type opioid receptor
Name:Kappa-type opioid receptor
Type:G Protein-Coupled Receptor (GPCR)
Mol. Mass.:42648.76
Organism:Homo sapiens (Human)
Description:P41145
Residue:380
BDBM50185330
NameBDBM50185330
Synonyms:CHEMBL3824356
TypeSmall organic molecule
Emp. Form.C33H35N3O4
Mol. Mass.537.6487
SMILESCOC(=O)N1CC[C@@H](NC(=O)[C@@H](N)Cc2c(C)cc(O)cc2C)c2cc(Cc3ccc4ccccc4c3)ccc12