Reaction Details
TargetKappa-type opioid receptor
LigandBDBM50185308
Substrate/Competitorn/a
Meas. Tech.ChEMBL_1587712 (CHEMBL3825892)
EC50 880±n/a nM
Citation Harland, AABender, AMGriggs, NWGao, CAnand, JPPogozheva, IDTraynor, JRJutkiewicz, EMMosberg, HI Effects of N-Substitutions on the Tetrahydroquinoline (THQ) Core of Mixed-Efficacyµ-Opioid Receptor (MOR)/d-Opioid Receptor (DOR) Ligands. J Med Chem59:4985-98 (2016) 
 
Kappa-type opioid receptor
Name:Kappa-type opioid receptor
Type:G Protein-Coupled Receptor (GPCR)
Mol. Mass.:42648.76
Organism:Homo sapiens (Human)
Description:P41145
Residue:380
BDBM50185308
NameBDBM50185308
Synonyms:CHEMBL3822956
TypeSmall organic molecule
Emp. Form.C30H35N3O3
Mol. Mass.485.6172
SMILESCCC(=O)N1CC[C@@H](NC(=O)[C@@H](N)Cc2c(C)cc(O)cc2C)c2cc(Cc3ccccc3)ccc12