Reaction Details
TargetKappa-type opioid receptor
LigandBDBM50185317
Substrate/Competitorn/a
Meas. Tech.ChEMBL_1587712 (CHEMBL3825892)
EC50>1300±n/a nM
Citation Harland, AABender, AMGriggs, NWGao, CAnand, JPPogozheva, IDTraynor, JRJutkiewicz, EMMosberg, HI Effects of N-Substitutions on the Tetrahydroquinoline (THQ) Core of Mixed-Efficacyµ-Opioid Receptor (MOR)/d-Opioid Receptor (DOR) Ligands. J Med Chem59:4985-98 (2016) 
 
Kappa-type opioid receptor
Name:Kappa-type opioid receptor
Type:G Protein-Coupled Receptor (GPCR)
Mol. Mass.:42648.76
Organism:Homo sapiens (Human)
Description:P41145
Residue:380
BDBM50185317
NameBDBM50185317
Synonyms:CHEMBL3823815
TypeSmall organic molecule
Emp. Form.C31H37N3O4
Mol. Mass.515.6432
SMILESCCOC(=O)CN1CC[C@@H](NC(=O)[C@@H](N)Cc2c(C)cc(O)cc2C)c2cc(Cc3ccccc3)ccc12