Reaction Details
TargetHepatocyte growth factor receptor
LigandBDBM50131679
Substrate/Competitorn/a
Meas. Tech.ChEMBL_1588142 (CHEMBL3825518)
IC50 20200±n/a nM
Citation Mohyeldin, MMBusnena, BAAkl, MRDragoi, AMCardelli, JAEl Sayed, KA Novel c-Met inhibitory olive secoiridoid semisynthetic analogs for the control of invasive breast cancer. Eur J Med Chem118:299-315 (2016) 
 
Hepatocyte growth factor receptor
Name:Hepatocyte growth factor receptor
Type:Protein
Mol. Mass.:155559.73
Organism:Homo sapiens (Human)
Description:P08581
Residue:1390
BDBM50131679
NameBDBM50131679
Synonyms:CHEMBL3628211 | p-Hydroxyphenylethyl p-coumarate (17)
TypeSmall organic molecule
Emp. Form.C17H16O4
Mol. Mass.284.3065
SMILESOc1ccc(CCOC(=O)\C=C\c2ccc(O)cc2)cc1