Reaction Details
TargetMu-type opioid receptor
LigandBDBM50185753
Substrate/Competitorn/a
Meas. Tech.ChEMBL_1588474 (CHEMBL3826757)
Ki 4.3±n/a nM
Citation Cai, YLu, DChen, ZDing, YChung, NNLi, TSchiller, PW [Dmt(1)]DALDA analogues modified with tyrosine analogues at position 1. Bioorg Med Chem Lett26:3629-31 (2016) 
 
Mu-type opioid receptor
Name:Mu-type opioid receptor
Type:G Protein-Coupled Receptor (GPCR)
Mol. Mass.:44503.11
Organism:Rattus norvegicus (rat)
Description:Competition binding assays were carried out using membrane preparations from transfected HN9.10 cells that constitutively expressed the mu opioid receptor.
Residue:398
BDBM50185753
NameBDBM50185753
Synonyms:CHEMBL3822702
TypeSmall organic molecule
Emp. Form.C34H53N9O5
Mol. Mass.667.8419
SMILESCC(C)c1cc(O)cc(C)c1C[C@H](N)C(=O)N[C@H](CCCNC(N)=N)C(=O)N[C@@H](Cc1ccccc1)C(=O)N[C@@H](CCCCN)C(N)=O