Reaction Details
TargetSerine/threonine-protein kinase PAK 1
LigandBDBM50185827
Substrate/Competitorn/a
Meas. Tech.ChEMBL_1589061 (CHEMBL3824459)
Ki 6.0±n/a nM
Citation Lee, WCrawford, JJAliagas, IMurray, LJTay, SWang, WHeise, CEHoeflich, KPLa, HMathieu, SMintzer, RRamaswamy, SRouge, LRudolph, J Synthesis and evaluation of a series of 4-azaindole-containing p21-activated kinase-1 inhibitors. Bioorg Med Chem Lett26:3518-24 (2016) 
 
Serine/threonine-protein kinase PAK 1
Name:Serine/threonine-protein kinase PAK 1
Type:n/a
Mol. Mass.:60640.15
Organism:Homo sapiens (Human)
Description:Q13153
Residue:545
BDBM50185827
NameBDBM50185827
Synonyms:CHEMBL3823523
TypeSmall organic molecule
Emp. Form.C19H19ClN8
Mol. Mass.394.861
SMILESC[C@H](Nc1nccc(Nc2cc([nH]n2)C2CC2)n1)c1ccc2[nH]cc(Cl)c2n1