Reaction Details
TargetGlucose-dependent insulinotropic receptor
LigandBDBM50186339
Substrate/Competitorn/a
Meas. Tech.ChEMBL_1587590 (CHEMBL3825575)
EC50 4.0±n/a nM
Citation Matsuda, DKobashi, YMikami, AKawamura, MShiozawa, FKawabe, KHamada, MOda, KNishimoto, SKimura, KMiyoshi, MTakayama, NKakinuma, HOhtake, N Design and synthesis of 1H-pyrazolo[3,4-c]pyridine derivatives as a novel structural class of potent GPR119 agonists. Bioorg Med Chem Lett26:3441-6 (2016) 
 
Glucose-dependent insulinotropic receptor
Name:Glucose-dependent insulinotropic receptor
Type:Protein
Mol. Mass.:36901.49
Organism:Homo sapiens (Human)
Description:Q8TDV5
Residue:335
BDBM50186339
NameBDBM50186339
Synonyms:CHEMBL3823780
TypeSmall organic molecule
Emp. Form.C24H25FN6O2S
Mol. Mass.480.558
SMILESCCc1cnc(nc1)N1CCC(CC1)n1ncc2cc(ncc12)-c1ccc(cc1F)S(C)(=O)=O