Reaction Details
TargetEstrogen receptor
LigandBDBM50186728
Substrate/Competitorn/a
Meas. Tech.ChEMBL_1587749 (CHEMBL3825990)
IC50 436±n/a nM
Citation Kelly, PMBright, SAFayne, DPollock, JKZisterer, DMWilliams, DCMeegan, MJ Synthesis, antiproliferative and pro-apoptotic activity of 2-phenylindoles. Bioorg Med Chem24:4075-4099 (2016) 
 
Estrogen receptor
Name:Estrogen receptor
Type:Protein
Mol. Mass.:66230.44
Organism:Homo sapiens (Human)
Description:P03372
Residue:595
BDBM50186728
NameBDBM50186728
Synonyms:CHEMBL3823426
TypeSmall organic molecule
Emp. Form.C34H32N2O4
Mol. Mass.532.6289
SMILESCc1c(-c2ccc(O)cc2)n(CCCCn2c(c(C)c3cc(O)ccc23)-c2ccc(O)cc2)c2ccc(O)cc12