Reaction Details
TargetEstrogen receptor beta
LigandBDBM50186729
Substrate/Competitorn/a
Meas. Tech.ChEMBL_1587750 (CHEMBL3825991)
IC50 155±n/a nM
Citation Kelly, PMBright, SAFayne, DPollock, JKZisterer, DMWilliams, DCMeegan, MJ Synthesis, antiproliferative and pro-apoptotic activity of 2-phenylindoles. Bioorg Med Chem24:4075-4099 (2016) 
 
Estrogen receptor beta
Name:Estrogen receptor beta
Type:Protein
Mol. Mass.:59238.43
Organism:Homo sapiens (Human)
Description:Q92731
Residue:530
BDBM50186729
NameBDBM50186729
Synonyms:CHEMBL3823192
TypeSmall organic molecule
Emp. Form.C47H58N2O8
Mol. Mass.778.972
SMILESCOc1ccc(\C=C(\C(=O)N(C)CCCCCCCCCCCCn2c(c(C)c3cc(O)ccc23)-c2ccc(O)cc2)c2cc(OC)c(OC)c(OC)c2)cc1O