Reaction Details
TargetHistone-lysine N-methyltransferase SETD7
LigandBDBM50187211
Substrate/Competitorn/a
Meas. Tech.ChEMBL_1589562 (CHEMBL3829237)
IC50>100000±n/a nM
Citation Fujiwara, TOhira, KUrushibara, KIto, AYoshida, MKanai, MTanatani, AKagechika, HHirano, T Steric structure-activity relationship of cyproheptadine derivatives as inhibitors of histone methyltransferase Set7/9. Bioorg Med Chem24:4318-4323 (2016) 
 
Histone-lysine N-methyltransferase SETD7
Name:Histone-lysine N-methyltransferase SETD7
Type:Enzyme
Mol. Mass.:40691.12
Organism:Homo sapiens (Human)
Description:Q8WTS6
Residue:366
BDBM50187211
NameBDBM50187211
Synonyms:CHEMBL20468
TypeSmall organic molecule
Emp. Form.C18H20N2O
Mol. Mass.280.3642
SMILESCN1CCN(CC1)C1c2ccccc2Oc2ccccc12