Reaction Details
TargetFatty acid-binding protein, adipocyte
LigandBDBM50187488
Substrate/Competitorn/a
Meas. Tech.ChEMBL_1589882 (CHEMBL3830762)
Ki 290±n/a nM
Citation Zhou, YNie, TZhang, YSong, MLi, KDing, MDing, KWu, DXu, Y The discovery of novel and selective fatty acid binding protein 4 inhibitors by virtual screening and biological evaluation. Bioorg Med Chem24:4310-4317 (2016) 
 
Fatty acid-binding protein, adipocyte
Name:Fatty acid-binding protein, adipocyte
Type:Enzyme
Mol. Mass.:14719.23
Organism:Homo sapiens (Human)
Description:P15090
Residue:132
BDBM50187488
NameBDBM50187488
Synonyms:CHEMBL3828508
TypeSmall organic molecule
Emp. Form.C19H18BrNO2
Mol. Mass.372.256
SMILESOC(=O)C1C2CC=CC2c2cc(Br)cc3C4C=CCC4CN1c23