Reaction Details
TargetFatty acid-binding protein, adipocyte
LigandBDBM50187489
Substrate/Competitorn/a
Meas. Tech.ChEMBL_1589882 (CHEMBL3830762)
Ki 380±n/a nM
Citation Zhou, YNie, TZhang, YSong, MLi, KDing, MDing, KWu, DXu, Y The discovery of novel and selective fatty acid binding protein 4 inhibitors by virtual screening and biological evaluation. Bioorg Med Chem24:4310-4317 (2016) 
 
Fatty acid-binding protein, adipocyte
Name:Fatty acid-binding protein, adipocyte
Type:Enzyme
Mol. Mass.:14719.23
Organism:Homo sapiens (Human)
Description:P15090
Residue:132
BDBM50187489
NameBDBM50187489
Synonyms:CHEMBL3827483
TypeSmall organic molecule
Emp. Form.C20H21NO2
Mol. Mass.307.3862
SMILESCc1cc2C3C=CCC3CN3C(C4CC=CC4c(c1)c23)C(O)=O