Reaction Details
TargetFatty acid-binding protein, adipocyte
LigandBDBM50187492
Substrate/Competitorn/a
Meas. Tech.ChEMBL_1589882 (CHEMBL3830762)
Ki 10300±n/a nM
Citation Zhou, YNie, TZhang, YSong, MLi, KDing, MDing, KWu, DXu, Y The discovery of novel and selective fatty acid binding protein 4 inhibitors by virtual screening and biological evaluation. Bioorg Med Chem24:4310-4317 (2016) 
 
Fatty acid-binding protein, adipocyte
Name:Fatty acid-binding protein, adipocyte
Type:Enzyme
Mol. Mass.:14719.23
Organism:Homo sapiens (Human)
Description:P15090
Residue:132
BDBM50187492
NameBDBM50187492
Synonyms:CHEMBL3827693
TypeSmall organic molecule
Emp. Form.C22H15Cl2N3O4
Mol. Mass.456.278
SMILESOC(=O)c1ccccc1N\N=C(/C(=O)Nc1cc(Cl)ccc1Cl)C(=O)c1ccccc1