Reaction Details
TargetFatty acid-binding protein, adipocyte
LigandBDBM53262
Substrate/Competitorn/a
Meas. Tech.ChEMBL_1589882 (CHEMBL3830762)
Ki 2300±n/a nM
Citation Zhou, YNie, TZhang, YSong, MLi, KDing, MDing, KWu, DXu, Y The discovery of novel and selective fatty acid binding protein 4 inhibitors by virtual screening and biological evaluation. Bioorg Med Chem24:4310-4317 (2016) 
 
Fatty acid-binding protein, adipocyte
Name:Fatty acid-binding protein, adipocyte
Type:Enzyme
Mol. Mass.:14719.23
Organism:Homo sapiens (Human)
Description:P15090
Residue:132
BDBM53262
NameBDBM53262
Synonyms:2-[4-[(4-chlorophenyl)sulfonylamino]-1-hydroxynaphthalen-2-yl]sulfanylacetic acid 2-[[4-[(4-chlorophenyl)sulfonylamino]-1-hydroxy-2-naphthalenyl]thio]acetic acid MLS001196186 [(4-{[(4-chlorophenyl)sulfonyl]amino}-1-hydroxy-2-naphthyl)thio]acetic acid | cid_1309516
TypeSmall organic molecule
Emp. Form.C18H14ClNO5S2
Mol. Mass.423.89
SMILESOC(=O)CSc1cc(NS(=O)(=O)c2ccc(Cl)cc2)c2ccccc2c1O