Reaction Details
TargetCarbonic anhydrase 1
LigandBDBM50069989
Substrate/Competitorn/a
Meas. Tech.ChEMBL_1590189 (CHEMBL3829723)
Ki 1290±n/a nM
Citation Supuran, CT Bortezomib inhibits bacterial and fungalß-carbonic anhydrases. Bioorg Med Chem24:4406-4409 (2016) 
 
Carbonic anhydrase 1
Name:Carbonic anhydrase 1
Type:Enzyme
Mol. Mass.:28873.37
Organism:Homo sapiens (Human)
Description:P00915
Residue:261
BDBM50069989
NameBDBM50069989
Synonyms:(R)-3-methyl-1-((S)-3-phenyl-2-(pyrazine-2-carboxamido)propanamido)butylboronic acid BORTEZOMIB Dipeptidyl boronic acid derivative N-[(1R)-1-(DIHYDROXYBORYL)-3-METHYLBUTYL]-N-(PYRAZIN-2-YLCARBONYL)-L-PHENYLALANINAMIDE Peptidyl boronic acid derivative Velcade | cid_387447
TypeSmall organic molecule
Emp. Form.C19H25BN4O4
Mol. Mass.384.237
SMILESCC(C)C[C@H](NC(=O)[C@H](Cc1ccccc1)NC(=O)c1cnccn1)B(O)O