Reaction Details
TargetCruzipain
LigandBDBM50157741
Substrate/Competitorn/a
Meas. Tech.ChEMBL_1590315 (CHEMBL3830354)
IC50 400±n/a nM
Citation Silva-Júnior, EFSilva, EPSFrança, PHBSilva, JPNBarreto, EOSilva, EBFerreira, RSGatto, CCMoreira, DRMSiqueira-Neto, JLMendonça-Júnior, FJBLima, MCABortoluzzi, JHScotti, MTScotti, LMeneghetti, MRAquino, TMAraújo-Júnior, JX Design, synthesis, molecular docking and biological evaluation of thiophen-2-iminothiazolidine derivatives for use against Trypanosoma cruzi. Bioorg Med Chem24:4228-4240 (2016) 
 
Cruzipain
Name:Cruzipain
Type:Protein
Mol. Mass.:49831.41
Organism:Trypanosoma cruzi
Description:P25779
Residue:467
BDBM50157741
NameBDBM50157741
Synonyms:CHEMBL374508 E64
TypeSmall organic molecule
Emp. Form.C15H27N5O5
Mol. Mass.357.4054
SMILES[#6]-[#6](-[#6])-[#6]-[#6@H](-[#7]-[#6](=O)-[#6@H]-1-[#8]-[#6@@H]-1-[#6](-[#8])=O)-[#6](=O)-[#7]-[#6]-[#6]-[#6]-[#6]\[#7]=[#6](/[#7])-[#7]