Reaction Details
TargetAdenosine receptor A1
LigandBDBM50187587
Substrate/Competitorn/a
Meas. Tech.ChEMBL_1590501 (CHEMBL3830977)
Ki 56±n/a nM
Citation Szymanska, EDrabczynska, AKarcz, TMüller, CEKöse, MKarolak-Wojciechowska, JFruzinski, ASchabikowski, JDoroz-Plonka, AHandzlik, JKiec-Kononowicz, K Similarities and differences in affinity and binding modes of tricyclic pyrimido- and pyrazinoxanthines at human and rat adenosine receptors. Bioorg Med Chem24:4347-4362 (2016) 
 
Adenosine receptor A1
Name:Adenosine receptor A1
Type:Protein
Mol. Mass.:36704.13
Organism:Rattus norvegicus (rat)
Description:n/a
Residue:326
BDBM50187587
NameBDBM50187587
Synonyms:CHEMBL3827598
TypeSmall organic molecule
Emp. Form.C26H38N6O3
Mol. Mass.482.6183
SMILESCCCCn1c2nc3N(CCCn3c2c(=O)n(CCCC)c1=O)c1ccc(OCCN(C)C)cc1