Reaction Details
TargetEctonucleotide pyrophosphatase/phosphodiesterase family member 2
LigandBDBM50187686
Substrate/Competitorn/a
Meas. Tech.ChEMBL_1591236 (CHEMBL3829628)
IC50 100±n/a nM
Citation Castagna, DBudd, DCMacdonald, SJJamieson, CWatson, AJ Development of Autotaxin Inhibitors: An Overview of the Patent and Primary Literature. J Med Chem59:5604-21 (2016) 
 
Ectonucleotide pyrophosphatase/phosphodiesterase family member 2
Name:Ectonucleotide pyrophosphatase/phosphodiesterase family member 2
Type:Enzyme
Mol. Mass.:99007.13
Organism:Homo sapiens (Human)
Description:Q13822
Residue:863
BDBM50187686
NameBDBM50187686
Synonyms:CHEMBL3828074 US11072611, Compound 2 US11591342, Compound GLPG1690 US9670204, 2 2-((2-ethyl-6-(4-(2-(3-hydroxyazetidin-1-yl)-2-oxoethyl)piperazin-1-yl)-8-methylimidazo[1,2-a]pyridin-3-yl)(methyl)amino)-4-(4-fluorophenyl)thiazole-5-carbonitrile | WO2014139882, Compound 2
TypeSmall organic molecule
Emp. Form.C30H33FN8O2S
Mol. Mass.588.699
SMILESCCc1nc2c(C)cc(cn2c1N(C)c1nc(c(s1)C#N)-c1ccc(F)cc1)N1CCN(CC(=O)N2CC(O)C2)CC1