Reaction Details
TargetEctonucleotide pyrophosphatase/phosphodiesterase family member 2
LigandBDBM50187689
Substrate/Competitorn/a
Meas. Tech.ChEMBL_1591232 (CHEMBL3829624)
IC50<1.7±n/a nM
Citation Castagna, DBudd, DCMacdonald, SJJamieson, CWatson, AJ Development of Autotaxin Inhibitors: An Overview of the Patent and Primary Literature. J Med Chem59:5604-21 (2016) 
 
Ectonucleotide pyrophosphatase/phosphodiesterase family member 2
Name:Ectonucleotide pyrophosphatase/phosphodiesterase family member 2
Type:Enzyme
Mol. Mass.:99007.13
Organism:Homo sapiens (Human)
Description:Q13822
Residue:863
BDBM50187689
NameBDBM50187689
Synonyms:CHEMBL3827513 | Example 9
TypeSmall organic molecule
Emp. Form.C24H22N8O
Mol. Mass.438.4845
SMILESO=C(N1CCc2nc(NC3Cc4ccccc4C3)ncc2C1)c1cc(ccn1)-c1cnn[nH]1