Reaction Details
TargetEctonucleotide pyrophosphatase/phosphodiesterase family member 2
LigandBDBM241106
Substrate/Competitorn/a
Meas. Tech.ChEMBL_1591109 (CHEMBL3829077)
IC50 2.0±n/a nM
Citation Castagna, DBudd, DCMacdonald, SJJamieson, CWatson, AJ Development of Autotaxin Inhibitors: An Overview of the Patent and Primary Literature. J Med Chem59:5604-21 (2016) 
 
Ectonucleotide pyrophosphatase/phosphodiesterase family member 2
Name:Ectonucleotide pyrophosphatase/phosphodiesterase family member 2
Type:Enzyme
Mol. Mass.:99007.13
Organism:Homo sapiens (Human)
Description:Q13822
Residue:863
BDBM241106
NameBDBM241106
Synonyms:US9409895, 17 | US9630945, 17
TypeSmall organic molecule
Emp. Form.C19H23Cl2N5O3
Mol. Mass.440.324
SMILESClc1cc(Cl)cc(COC(=O)N2CCC(CC2)NC(=O)CCCc2c[nH]nn2)c1