Reaction Details
TargetTransient receptor potential cation channel subfamily V member 3
LigandBDBM50187699
Substrate/Competitorn/a
Meas. Tech.ChEMBL_1589082 (CHEMBL3829467)
IC50 380±n/a nM
Citation Gomtsyan, ASchmidt, RGBayburt, EKGfesser, GAVoight, EADaanen, JFSchmidt, DLCowart, MDLiu, HAltenbach, RJKort, MEClapham, BCox, PBShrestha, AHenry, RWhittern, DNReilly, RMPuttfarcken, PSBrederson, JDSong, PLi, BHuang, SMMcDonald, HANeelands, TRMcGaraughty, SPGauvin, DMJoshi, SKBanfor, PNSegreti, JAShebley, MFaltynek, CRDart, MJKym, PR Synthesis and Pharmacology of (Pyridin-2-yl)methanol Derivatives as Novel and Selective Transient Receptor Potential Vanilloid 3 Antagonists. J Med Chem59:4926-47 (2016) 
 
Transient receptor potential cation channel subfamily V member 3
Name:Transient receptor potential cation channel subfamily V member 3
Type:Enzyme
Mol. Mass.:90635.51
Organism:Homo sapiens (Human)
Description:Q8NET8
Residue:790
BDBM50187699
NameBDBM50187699
Synonyms:CHEMBL3828340
TypeSmall organic molecule
Emp. Form.C17H17F3N2O2
Mol. Mass.338.3243
SMILESC[C@@]1(O)C[C@](C1)([C@H](O)c1ccccn1)c1cc(ccn1)C(F)(F)F