Reaction Details
TargetSerine protease hepsin
LigandBDBM50187705
Substrate/Competitorn/a
Meas. Tech.ChEMBL_1589258 (CHEMBL3830286)
IC50 2800±n/a nM
Citation Subedi, MMinn, IChen, JKim, YOk, KJung, YWPomper, MGByun, Y Design, synthesis and biological evaluation of PSMA/hepsin-targeted heterobivalent ligands. Eur J Med Chem118:208-218 (2016) 
 
Serine protease hepsin
Name:Serine protease hepsin
Type:Enzyme
Mol. Mass.:45016.98
Organism:Homo sapiens (Human)
Description:Human deglycosylated hepsin was expressed in Pichia pastoris.
Residue:417
BDBM50187705
NameBDBM50187705
Synonyms:CHEMBL3828668
TypeSmall organic molecule
Emp. Form.C85H104N11O18S2
Mol. Mass.1631.929
SMILESCN1\C(=C\C=C2/CCCC(\C=C\C3=[N+](CCCCCC(=O)NCCCCC(NC(=O)CCCCCCC(=O)NCCCCC(NC(=O)NC(CCC(O)=O)C(O)=O)C(O)=O)C(=O)NCc4ccc(cc4)-c4ccc(O)c(c4)-c4cc5cc(ccc5[nH]4)C(N)=N)c4ccc(cc4C3(C)C)S([O-])(=O)=O)=C2)C(C)(C)c2cc(ccc12)S([O-])(=O)=O