Reaction Details
TargetSerine protease hepsin
LigandBDBM50187706
Substrate/Competitorn/a
Meas. Tech.ChEMBL_1589258 (CHEMBL3830286)
IC50 14000±n/a nM
Citation Subedi, MMinn, IChen, JKim, YOk, KJung, YWPomper, MGByun, Y Design, synthesis and biological evaluation of PSMA/hepsin-targeted heterobivalent ligands. Eur J Med Chem118:208-218 (2016) 
 
Serine protease hepsin
Name:Serine protease hepsin
Type:Enzyme
Mol. Mass.:45016.98
Organism:Homo sapiens (Human)
Description:Human deglycosylated hepsin was expressed in Pichia pastoris.
Residue:417
BDBM50187706
NameBDBM50187706
Synonyms:CHEMBL3828589
TypeSmall organic molecule
Emp. Form.C22H16F3N3O
Mol. Mass.395.3771
SMILESNC(=N)c1ccc2[nH]c(cc2c1)-c1cc(ccc1O)-c1ccc(cc1)C(F)(F)F