Reaction Details
TargetTyrosine-protein kinase receptor TYRO3
LigandBDBM50187716
Substrate/Competitorn/a
Meas. Tech.ChEMBL_1589284 (CHEMBL3830312)
IC50 72±n/a nM
Citation Song, ZXia, ZJi, YXing, LGao, YAi, JGeng, MZhang, A An orally available tyrosine kinase ALK and RET dual inhibitor bearing the tetracyclic benzo[b]carbazolone core. Eur J Med Chem118:244-9 (2016) 
 
Tyrosine-protein kinase receptor TYRO3
Name:Tyrosine-protein kinase receptor TYRO3
Type:Protein
Mol. Mass.:96894.13
Organism:Homo sapiens (Human)
Description:Q06418
Residue:890
BDBM50187716
NameBDBM50187716
Synonyms:CHEMBL3735648
TypeSmall organic molecule
Emp. Form.C30H33N3O2
Mol. Mass.467.6019
SMILESCC1(C)c2[nH]c3cc(ccc3c2C(=O)c2ccc(cc12)C1CCN(CC2CCOCC2)CC1)C#N