Reaction Details
TargetVascular endothelial growth factor receptor 1
LigandBDBM50187716
Substrate/Competitorn/a
Meas. Tech.ChEMBL_1589291 (CHEMBL3830421)
IC50 159±n/a nM
Citation Song, ZXia, ZJi, YXing, LGao, YAi, JGeng, MZhang, A An orally available tyrosine kinase ALK and RET dual inhibitor bearing the tetracyclic benzo[b]carbazolone core. Eur J Med Chem118:244-9 (2016) 
 
Vascular endothelial growth factor receptor 1
Name:Vascular endothelial growth factor receptor 1
Type:Receptor Tyrosine Kinase
Mol. Mass.:150800.23
Organism:Homo sapiens (Human)
Description:P17948
Residue:1338
BDBM50187716
NameBDBM50187716
Synonyms:CHEMBL3735648
TypeSmall organic molecule
Emp. Form.C30H33N3O2
Mol. Mass.467.6019
SMILESCC1(C)c2[nH]c3cc(ccc3c2C(=O)c2ccc(cc12)C1CCN(CC2CCOCC2)CC1)C#N