Reaction Details
TargetALK tyrosine kinase receptor
LigandBDBM50187716
Substrate/Competitorn/a
Meas. Tech.ChEMBL_1589435 (CHEMBL3831020)
IC50 38±n/a nM
Citation Song, ZXia, ZJi, YXing, LGao, YAi, JGeng, MZhang, A An orally available tyrosine kinase ALK and RET dual inhibitor bearing the tetracyclic benzo[b]carbazolone core. Eur J Med Chem118:244-9 (2016) 
 
ALK tyrosine kinase receptor
Name:ALK tyrosine kinase receptor
Type:Protein
Mol. Mass.:176453.10
Organism:Homo sapiens (Human)
Description:Q9UM73
Residue:1620
BDBM50187716
NameBDBM50187716
Synonyms:CHEMBL3735648
TypeSmall organic molecule
Emp. Form.C30H33N3O2
Mol. Mass.467.6019
SMILESCC1(C)c2[nH]c3cc(ccc3c2C(=O)c2ccc(cc12)C1CCN(CC2CCOCC2)CC1)C#N