Reaction Details
TargetPoly [ADP-ribose] polymerase tankyrase-1
LigandBDBM50188471
Substrate/Competitorn/a
Meas. Tech.ChEMBL_1589939 (CHEMBL3830929)
IC50 22±n/a nM
Citation Nathubhai, AHaikarainen, THayward, PCMuñoz-Descalzo, SThompson, ASLloyd, MDLehtiö, LThreadgill, MD Structure-activity relationships of 2-arylquinazolin-4-ones as highly selective and potent inhibitors of the tankyrases. Eur J Med Chem118:316-27 (2016) 
 
Poly [ADP-ribose] polymerase tankyrase-1
Name:Poly [ADP-ribose] polymerase tankyrase-1
Type:Enzyme
Mol. Mass.:142058.03
Organism:Homo sapiens (Human)
Description:O95271
Residue:1327
BDBM50188471
NameBDBM50188471
Synonyms:CHEMBL3827272
TypeSmall organic molecule
Emp. Form.C15H12N2O2
Mol. Mass.252.268
SMILESCc1ccc(cc1)-c1nc2c(O)cccc2c(=O)[nH]1