Reaction Details
TargetPoly [ADP-ribose] polymerase tankyrase-1
LigandBDBM50188248
Substrate/Competitorn/a
Meas. Tech.ChEMBL_1589939 (CHEMBL3830929)
IC50 47±n/a nM
Citation Nathubhai, AHaikarainen, THayward, PCMuñoz-Descalzo, SThompson, ASLloyd, MDLehtiö, LThreadgill, MD Structure-activity relationships of 2-arylquinazolin-4-ones as highly selective and potent inhibitors of the tankyrases. Eur J Med Chem118:316-27 (2016) 
 
Poly [ADP-ribose] polymerase tankyrase-1
Name:Poly [ADP-ribose] polymerase tankyrase-1
Type:Enzyme
Mol. Mass.:142058.03
Organism:Homo sapiens (Human)
Description:O95271
Residue:1327
BDBM50188248
NameBDBM50188248
Synonyms:CHEMBL3827440
TypeSmall organic molecule
Emp. Form.C14H9BrN2O2
Mol. Mass.317.137
SMILESOc1cccc2c1nc([nH]c2=O)-c1ccc(Br)cc1