Reaction Details
TargetHistone deacetylase 1
LigandBDBM50188892
Substrate/Competitorn/a
Meas. Tech.ChEMBL_1590558 (CHEMBL3828935)
IC50 0.550000±n/a nM
Citation Chen, YWang, XXiang, WHe, LTang, MWang, FWang, TYang, ZYi, YWang, HNiu, TZheng, LLei, LLi, XSong, HChen, L Development of Purine-Based Hydroxamic Acid Derivatives: Potent Histone Deacetylase Inhibitors with Marked in Vitro and in Vivo Antitumor Activities. J Med Chem59:5488-504 (2016) 
 
Histone deacetylase 1
Name:Histone deacetylase 1
Type:Enzyme
Mol. Mass.:55090.27
Organism:Homo sapiens (Human)
Description:Q13547
Residue:482
BDBM50188892
NameBDBM50188892
Synonyms:CHEMBL3828492
TypeSmall organic molecule
Emp. Form.C23H25N9O4
Mol. Mass.491.5025
SMILESCN(Cc1nc2c(nc(nc2n1C)-c1cccc(O)c1)N1CCOCC1)c1ncc(cn1)C(=O)NO