Reaction Details
TargetHistone deacetylase 2
LigandBDBM50188961
Substrate/Competitorn/a
Meas. Tech.ChEMBL_1590563 (CHEMBL3829032)
IC50 5.0±n/a nM
Citation Chen, YWang, XXiang, WHe, LTang, MWang, FWang, TYang, ZYi, YWang, HNiu, TZheng, LLei, LLi, XSong, HChen, L Development of Purine-Based Hydroxamic Acid Derivatives: Potent Histone Deacetylase Inhibitors with Marked in Vitro and in Vivo Antitumor Activities. J Med Chem59:5488-504 (2016) 
 
Histone deacetylase 2
Name:Histone deacetylase 2
Type:Chromatin regulator; hydrolase; repressor
Mol. Mass.:55356.54
Organism:Homo sapiens (Human)
Description:Q92769
Residue:488
BDBM50188961
NameBDBM50188961
Synonyms:CHEMBL3622533
TypeSmall organic molecule
Emp. Form.C23H24N8O4S
Mol. Mass.508.553
SMILESCOc1ccc(cn1)-c1nc(N2CCOCC2)c2sc(CN(C)c3ncc(cn3)C(=O)NO)cc2n1