Reaction Details
TargetHistone deacetylase 8
LigandBDBM50188899
Substrate/Competitorn/a
Meas. Tech.ChEMBL_1590565 (CHEMBL3829034)
IC50 11±n/a nM
Citation Chen, YWang, XXiang, WHe, LTang, MWang, FWang, TYang, ZYi, YWang, HNiu, TZheng, LLei, LLi, XSong, HChen, L Development of Purine-Based Hydroxamic Acid Derivatives: Potent Histone Deacetylase Inhibitors with Marked in Vitro and in Vivo Antitumor Activities. J Med Chem59:5488-504 (2016) 
 
Histone deacetylase 8
Name:Histone deacetylase 8
Type:Enzyme
Mol. Mass.:41749.60
Organism:Homo sapiens (Human)
Description:Q9BY41
Residue:377
BDBM50188899
NameBDBM50188899
Synonyms:CHEMBL3827517
TypeSmall organic molecule
Emp. Form.C22H24N10O3
Mol. Mass.476.4912
SMILESCN(Cc1nc2c(nc(nc2n1C)-c1ccncc1)N1CCOCC1)c1ncc(cn1)C(=O)NO