Reaction Details
TargetHistone deacetylase 5
LigandBDBM50188897
Substrate/Competitorn/a
Meas. Tech.ChEMBL_1590567 (CHEMBL3829036)
IC50>1000±n/a nM
Citation Chen, YWang, XXiang, WHe, LTang, MWang, FWang, TYang, ZYi, YWang, HNiu, TZheng, LLei, LLi, XSong, HChen, L Development of Purine-Based Hydroxamic Acid Derivatives: Potent Histone Deacetylase Inhibitors with Marked in Vitro and in Vivo Antitumor Activities. J Med Chem59:5488-504 (2016) 
 
Histone deacetylase 5
Name:Histone deacetylase 5
Type:Enzyme
Mol. Mass.:121968.61
Organism:Homo sapiens (Human)
Description:Q9UQL6
Residue:1122
BDBM50188897
NameBDBM50188897
Synonyms:CHEMBL3827281
TypeSmall organic molecule
Emp. Form.C23H26N10O4
Mol. Mass.506.5171
SMILESCOc1ccc(cn1)-c1nc(N2CCOCC2)c2nc(CN(C)c3ncc(cn3)C(=O)NO)n(C)c2n1