Reaction Details
TargetHistone deacetylase 1
LigandBDBM50188894
Substrate/Competitorn/a
Meas. Tech.ChEMBL_1590558 (CHEMBL3828935)
IC50 1.1±n/a nM
Citation Chen, YWang, XXiang, WHe, LTang, MWang, FWang, TYang, ZYi, YWang, HNiu, TZheng, LLei, LLi, XSong, HChen, L Development of Purine-Based Hydroxamic Acid Derivatives: Potent Histone Deacetylase Inhibitors with Marked in Vitro and in Vivo Antitumor Activities. J Med Chem59:5488-504 (2016) 
 
Histone deacetylase 1
Name:Histone deacetylase 1
Type:Enzyme
Mol. Mass.:55090.27
Organism:Homo sapiens (Human)
Description:Q13547
Residue:482
BDBM50188894
NameBDBM50188894
Synonyms:CHEMBL3827004
TypeSmall organic molecule
Emp. Form.C21H23N11O3
Mol. Mass.477.4792
SMILESCN(Cc1nc2c(nc(nc2n1C)-c1cncnc1)N1CCOCC1)c1ncc(cn1)C(=O)NO