Reaction Details
TargetHistone deacetylase 9
LigandBDBM50188959
Substrate/Competitorn/a
Meas. Tech.ChEMBL_1590569 (CHEMBL3829038)
IC50>1000±n/a nM
Citation Chen, YWang, XXiang, WHe, LTang, MWang, FWang, TYang, ZYi, YWang, HNiu, TZheng, LLei, LLi, XSong, HChen, L Development of Purine-Based Hydroxamic Acid Derivatives: Potent Histone Deacetylase Inhibitors with Marked in Vitro and in Vivo Antitumor Activities. J Med Chem59:5488-504 (2016) 
 
Histone deacetylase 9
Name:Histone deacetylase 9
Type:Enzyme
Mol. Mass.:111304.31
Organism:Homo sapiens (Human)
Description:Q9UKV0
Residue:1011
BDBM50188959
NameBDBM50188959
Synonyms:CHEMBL3827894
TypeSmall organic molecule
Emp. Form.C21H24N12O3
Mol. Mass.492.4939
SMILESCN(Cc1nc2c(nc(nc2n1C)-c1cnc(N)nc1)N1CCOCC1)c1ncc(cn1)C(=O)NO