Reaction Details
TargetHistone deacetylase 6
LigandBDBM50188891
Substrate/Competitorn/a
Meas. Tech.ChEMBL_1590570 (CHEMBL3829039)
IC50 7.8±n/a nM
Citation Chen, YWang, XXiang, WHe, LTang, MWang, FWang, TYang, ZYi, YWang, HNiu, TZheng, LLei, LLi, XSong, HChen, L Development of Purine-Based Hydroxamic Acid Derivatives: Potent Histone Deacetylase Inhibitors with Marked in Vitro and in Vivo Antitumor Activities. J Med Chem59:5488-504 (2016) 
 
Histone deacetylase 6
Name:Histone deacetylase 6
Type:Chromatin regulator; hydrolase; repressor
Mol. Mass.:131381.51
Organism:Homo sapiens (Human)
Description:Q9UBN7
Residue:1215
BDBM50188891
NameBDBM50188891
Synonyms:CHEMBL3828518
TypeSmall organic molecule
Emp. Form.C24H27N9O4
Mol. Mass.505.5291
SMILESCOc1ccc(cc1)-c1nc(N2CCOCC2)c2nc(CN(C)c3ncc(cn3)C(=O)NO)n(C)c2n1