Reaction Details
TargetPolyamine deacetylase HDAC10
LigandBDBM50188637
Substrate/Competitorn/a
Meas. Tech.ChEMBL_1590571 (CHEMBL3829040)
IC50 2.8±n/a nM
Citation Chen, YWang, XXiang, WHe, LTang, MWang, FWang, TYang, ZYi, YWang, HNiu, TZheng, LLei, LLi, XSong, HChen, L Development of Purine-Based Hydroxamic Acid Derivatives: Potent Histone Deacetylase Inhibitors with Marked in Vitro and in Vivo Antitumor Activities. J Med Chem59:5488-504 (2016) 
 
Polyamine deacetylase HDAC10
Name:Polyamine deacetylase HDAC10
Type:Chromatin regulator; hydrolase; repressor
Mol. Mass.:71431.89
Organism:Homo sapiens (Human)
Description:Q969S8
Residue:669
BDBM50188637
NameBDBM50188637
Synonyms:CHEMBL3827814
TypeSmall organic molecule
Emp. Form.C23H26N10O3
Mol. Mass.490.5177
SMILESCN(Cc1nc2c(nc(nc2n1C)-c1ccc(N)cc1)N1CCOCC1)c1ncc(cn1)C(=O)NO