Reaction Details
TargetPolyamine deacetylase HDAC10
LigandBDBM50188961
Substrate/Competitorn/a
Meas. Tech.ChEMBL_1590571 (CHEMBL3829040)
IC50 2.8±n/a nM
Citation Chen, YWang, XXiang, WHe, LTang, MWang, FWang, TYang, ZYi, YWang, HNiu, TZheng, LLei, LLi, XSong, HChen, L Development of Purine-Based Hydroxamic Acid Derivatives: Potent Histone Deacetylase Inhibitors with Marked in Vitro and in Vivo Antitumor Activities. J Med Chem59:5488-504 (2016) 
 
Polyamine deacetylase HDAC10
Name:Polyamine deacetylase HDAC10
Type:Chromatin regulator; hydrolase; repressor
Mol. Mass.:71431.89
Organism:Homo sapiens (Human)
Description:Q969S8
Residue:669
BDBM50188961
NameBDBM50188961
Synonyms:CHEMBL3622533
TypeSmall organic molecule
Emp. Form.C23H24N8O4S
Mol. Mass.508.553
SMILESCOc1ccc(cn1)-c1nc(N2CCOCC2)c2sc(CN(C)c3ncc(cn3)C(=O)NO)cc2n1