Reaction Details
TargetPhosphatidylinositol 4,5-bisphosphate 3-kinase catalytic subunit beta isoform
LigandBDBM50188637
Substrate/Competitorn/a
Meas. Tech.ChEMBL_1590575 (CHEMBL3829044)
IC50>10000±n/a nM
Citation Chen, YWang, XXiang, WHe, LTang, MWang, FWang, TYang, ZYi, YWang, HNiu, TZheng, LLei, LLi, XSong, HChen, L Development of Purine-Based Hydroxamic Acid Derivatives: Potent Histone Deacetylase Inhibitors with Marked in Vitro and in Vivo Antitumor Activities. J Med Chem59:5488-504 (2016) 
 
Phosphatidylinositol 4,5-bisphosphate 3-kinase catalytic subunit beta isoform
Name:Phosphatidylinositol 4,5-bisphosphate 3-kinase catalytic subunit beta isoform
Type:Enzyme Subunit
Mol. Mass.:122769.00
Organism:Homo sapiens (Human)
Description:P42338
Residue:1070
BDBM50188637
NameBDBM50188637
Synonyms:CHEMBL3827814
TypeSmall organic molecule
Emp. Form.C23H26N10O3
Mol. Mass.490.5177
SMILESCN(Cc1nc2c(nc(nc2n1C)-c1ccc(N)cc1)N1CCOCC1)c1ncc(cn1)C(=O)NO