Reaction Details
TargetPhosphatidylinositol 4,5-bisphosphate 3-kinase catalytic subunit gamma isoform
LigandBDBM50188961
Substrate/Competitorn/a
Meas. Tech.ChEMBL_1590576 (CHEMBL3829045)
IC50 311±n/a nM
Citation Chen, YWang, XXiang, WHe, LTang, MWang, FWang, TYang, ZYi, YWang, HNiu, TZheng, LLei, LLi, XSong, HChen, L Development of Purine-Based Hydroxamic Acid Derivatives: Potent Histone Deacetylase Inhibitors with Marked in Vitro and in Vivo Antitumor Activities. J Med Chem59:5488-504 (2016) 
 
Phosphatidylinositol 4,5-bisphosphate 3-kinase catalytic subunit gamma isoform
Name:Phosphatidylinositol 4,5-bisphosphate 3-kinase catalytic subunit gamma isoform
Type:Enzyme Subunit
Mol. Mass.:126470.30
Organism:Homo sapiens (Human)
Description:P48736
Residue:1102
BDBM50188961
NameBDBM50188961
Synonyms:CHEMBL3622533
TypeSmall organic molecule
Emp. Form.C23H24N8O4S
Mol. Mass.508.553
SMILESCOc1ccc(cn1)-c1nc(N2CCOCC2)c2sc(CN(C)c3ncc(cn3)C(=O)NO)cc2n1