Reaction Details
TargetHistone deacetylase 6
LigandBDBM50188637
Substrate/Competitorn/a
Meas. Tech.ChEMBL_1590579 (CHEMBL3829048)
EC50 211±n/a nM
Citation Chen, YWang, XXiang, WHe, LTang, MWang, FWang, TYang, ZYi, YWang, HNiu, TZheng, LLei, LLi, XSong, HChen, L Development of Purine-Based Hydroxamic Acid Derivatives: Potent Histone Deacetylase Inhibitors with Marked in Vitro and in Vivo Antitumor Activities. J Med Chem59:5488-504 (2016) 
 
Histone deacetylase 6
Name:Histone deacetylase 6
Type:Chromatin regulator; hydrolase; repressor
Mol. Mass.:131381.51
Organism:Homo sapiens (Human)
Description:Q9UBN7
Residue:1215
BDBM50188637
NameBDBM50188637
Synonyms:CHEMBL3827814
TypeSmall organic molecule
Emp. Form.C23H26N10O3
Mol. Mass.490.5177
SMILESCN(Cc1nc2c(nc(nc2n1C)-c1ccc(N)cc1)N1CCOCC1)c1ncc(cn1)C(=O)NO