Reaction Details
TargetAdenosine receptor A1
LigandBDBM50150078
Substrate/Competitorn/a
Meas. Tech.ChEMBL_1591043 (CHEMBL3831128)
Ki 4.4±n/a nM
Citation Bharate, SBSingh, BKachler, SOliveira, AKumar, VBharate, SSVishwakarma, RAKlotz, KNGutiérrez de Terán, H Discovery of 7-(Prolinol-N-yl)-2-phenylamino-thiazolo[5,4-d]pyrimidines as Novel Non-Nucleoside Partial Agonists for the A2A Adenosine Receptor: Prediction from Molecular Modeling. J Med Chem59:5922-8 (2016) 
 
Adenosine receptor A1
Name:Adenosine receptor A1
Type:G Protein-Coupled Receptor (GPCR)
Mol. Mass.:36520.92
Organism:Homo sapiens (Human)
Description:P30542
Residue:326
BDBM50150078
NameBDBM50150078
Synonyms:2-Amino-4-(3-hydroxy-phenyl)-6-(1H-imidazol-2-ylmethylsulfanyl)-pyridine-3,5-dicarbonitrile | CHEMBL122806
TypeSmall organic molecule
Emp. Form.C17H12N6OS
Mol. Mass.348.382
SMILESNc1nc(SCc2ncc[nH]2)c(C#N)c(-c2cccc(O)c2)c1C#N